{"text_format":"1","workbook":"xlsx","n_sheets":10,"sheets":["連絡担当者情報","企業情報","商品情報_1_JP","商品情報_2_JP","商品情報_3_JP","Company profile","Product_1_EN","Product_2_EN","Product_3_EN","データ(保護有り 削除不可）"],"not_rendered":{"charts":0,"images":7,"macros":1,"external_links":0,"defined_names":50,"comments":5,"pivot_tables":0},"unopened":[],"bounds":{"document_bytes":16777216,"sheet_cells":100000,"rows_first":2000,"rows_last":500,"rows_between":2000,"halvings":0,"cell_chars":16384,"cell_head_chars":4096},"cells_cut":0,"cells_raw":0,"read":"whole","date_system":"1900"}

{"sheet":"連絡担当者情報","index":0,"n_rows":12,"n_cols":40,"rows_kept":12,"cut":false,"hidden":false,"merged":[[0,0,0,38],[1,0,1,14],[1,15,1,38],[2,0,5,10],[2,11,2,38],[3,11,3,38],[4,11,4,23],[4,24,4,38],[5,11,5,23],[5,24,5,38],[8,0,8,10],[8,11,8,38],[11,0,11,10],[11,11,11,38],[6,0,6,10],[6,11,6,38],[7,11,7,38],[7,0,7,10],[10,0,10,10],[10,11,10,38],[9,0,9,10],[9,11,9,38]]}
["「FOOD HOKKAIDO 2024」 エントリーシート【担当者情報】\n\n\n※(必須)欄は必ず記入いただくようお願いします。また、フォーマットを変更(シートを追加する等)されないようお願いします。",null,null,null,null,null,null,null,null,null,null,null,null,null,null,null,null,null,null,null,null,null,null,null,null,null,null,null,null,null,null,null,null,null,null,null,null,null,null,"ver1.2018"]
["【事務局記入欄】企業No."]
["貴社・団体名(正式名称)\n（必須）",null,null,null,null,null,null,null,null,null,null,"日本語"]
[]
[null,null,null,null,null,null,null,null,null,null,null,"(フリガナ)　",null,null,null,null,null,null,null,null,null,null,null,null,"英語（必須）"]
[]
{"$rows_left_out":7}
{"sheet":"企業情報","index":1,"n_rows":88,"n_cols":46,"rows_kept":88,"cut":false,"hidden":false,"merged":[[35,10,35,22],[35,0,35,7],[35,25,35,38],[33,17,33,38],[39,0,39,38],[33,2,33,12],[27,0,27,38],[25,0,25,8],[25,27,25,30],[56,23,56,38],[55,19,55,38],[55,0,55,18],[52,12,52,38],[48,12,48,38],[28,0,29,38],[54,0,54,18],[49,0,52,11],[47,0,47,38],[31,0,31,38],[30,0,30,38],[33,13,33,16],[45,0,45,38],[44,0,44,38],[36,0,36,38],[42,6,42,38],[43,0,43,38],[37,0,37,38],[38,0,38,38],[49,12,49,38],[48,0,48,11],[46,0,46,38],[32,0,32,38],[41,0,41,38],[53,0,53,11],[53,12,53,38],[51,12,51,38],[50,12,50,38],[42,0,42,5],[35,8,35,9],[18,8,18,15],[12,7,12,18],[9,15,9,24],[9,11,9,14],[12,19,12,24],[12,25,12,38],[13,7,13,38],[22,0,22,7],[17,0,17,38],[18,0,18,7],[22,24,22,30],[22,16,22,23],[25,18,25,26],[25,9,25,17],[26,0,26,38],[35,23,35,24],[40,0,40,38],[33,0,33,1],[16,0,16,38],[14,24,14,28],[20,0,20,7],[21,0,21,7],[22,31,22,38],[23,6,23,38],[13,0,13,6],[20,16,20,23],[18,16,18,23],[21,31,21,38],[19,0,19,38],[21,8,21,15],[22,8,22,15],[20,24,20,30],[20,8,20,15],[14,34,14,37],[18,24,18,31],[14,30,15,33],[15,37,15,38],[15,24,15,27],[15,34,15,36],[20,31,20,38],[23,0,23,5],[77,1,79,36],[86,1,86,36],[0,0,0,38],[3,11,3,38],[21,24,21,30],[21,16,21,23],[18,32,18,38],[4,11,4,23],[5,24,5,38],[8,17,8,19],[4,24,4,38],[1,0,1,14],[1,15,1,38],[7,11,7,38],[2,0,5,10],[5,11,5,23],[8,20,8,26],[7,0,11,10],[9,25,9,28],[10,11,10,38],[2,11,2,38],[24,0,24,38],[25,31,25,38],[12,0,12,6],[6,0,6,10],[6,11,6,38],[14,0,15,4],[14,9,15,9],[14,5,15,8],[14,10,15,13],[14,19,15,19],[14,14,15,18],[14,20,15,23],[15,28,15,29],[11,11,11,38],[8,27,8,29],[8,30,8,38],[8,12,8,16],[9,29,9,38]]}
["「FOOD HOKKAIDO 2024」 エントリーシート【企業情報】\n【注意事項】\n※海外バイヤーとの商談のため、英語で入力していただく箇所もございます。\n　翻訳会社の紹介が必要な場合はお問い合わせください。\n\n※(必須)欄は必ず記入いただくようお願いします。また、フォーマットを変更(シートを追加する等)されないようお願いします。",null,null,null,null,null,null,null,null,null,null,null,null,null,null,null,null,null,null,null,null,null,null,null,null,null,null,null,null,null,null,null,null,null,null,null,null,null,null,"ver1.2018"]
["【事務局記入欄】企業No."]
["貴社・団体名(正式名称)\n（必須）",null,null,null,null,null,null,null,null,null,null,"日本語"]
[null,null,null,null,null,null,null,null,null,null,null,{"$f":"連絡担当者情報!L4","v":0}]
[null,null,null,null,null,null,null,null,null,null,null,"(フリガナ)　",null,null,null,null,null,null,null,null,null,null,null,null,"英語（必須）"]
[null,null,null,null,null,null,null,null,null,null,null,{"$f":"連絡担当者情報!L6","v":0},null,null,null,null,null,null,null,null,null,null,null,null,{"$f":"連絡担当者情報!Y6","v":0}]
{"$rows_left_out":83}
{"sheet":"商品情報_1_JP","index":2,"n_rows":105,"n_cols":46,"rows_kept":105,"cut":false,"hidden":false,"merged":[[56,0,56,7],[56,8,56,9],[56,10,56,22],[56,23,56,24],[56,25,56,38],[74,26,74,31],[75,26,75,31],[74,33,74,37],[75,33,75,37],[75,9,75,14],[66,0,66,38],[59,0,59,38],[55,16,55,23],[55,24,55,31],[55,32,55,38],[54,0,54,7],[54,8,54,15],[54,16,54,23],[54,24,54,31],[54,32,54,38],[55,0,55,7],[7,27,9,38],[32,27,32,38],[33,27,33,38],[34,27,34,38],[35,27,35,38],[10,0,35,25],[53,0,53,38],[85,0,85,38],[70,26,70,38],[70,0,70,12],[70,13,70,25],[74,0,74,23],[81,0,81,38],[82,0,83,38],[71,0,71,12],[78,0,78,38],[75,15,75,17],[77,0,77,38],[75,20,75,22],[72,0,72,5],[72,6,72,38],[71,13,71,18],[71,19,71,25],[55,8,55,15],[26,27,26,38],[29,27,29,36],[79,0,80,38],[60,0,60,8],[60,9,60,18],[60,19,60,28],[63,0,63,38],[61,9,61,15],[61,16,61,21],[61,22,61,27],[64,0,64,22],[64,23,64,38],[61,28,61,32],[67,0,67,7],[67,8,67,15],[67,16,67,23],[67,24,67,31],[67,32,67,38],[61,0,61,8],[61,33,61,38],[65,23,65,38],[69,0,69,38],[75,0,75,8],[43,0,44,38],[21,27,21,29],[21,30,21,36],[21,37,21,38],[12,27,12,29],[11,37,11,38],[10,27,10,38],[15,30,15,36],[13,30,13,36],[60,29,60,38],[31,37,31,38],[11,27,11,29],[13,27,13,29],[11,30,11,36],[25,27,25,30],[15,37,15,38],[22,27,22,38],[12,30,12,36],[12,37,12,38],[28,27,28,38],[46,0,46,38],[15,27,15,29],[27,28,27,32],[17,37,17,38],[40,0,41,38],[8,0,8,25],[5,0,5,25],[5,27,5,38],[6,0,6,25],[7,0,7,25],[47,0,48,38],[49,0,49,38],[50,0,51,38],[18,37,18,38],[18,30,18,36],[20,30,20,36],[23,37,23,38],[19,30,19,36],[45,0,45,38],[42,0,42,38],[39,0,39,38],[38,0,38,38],[19,27,19,29],[30,27,30,38],[29,37,29,38],[27,34,27,38],[24,27,24,38],[23,27,23,36],[31,27,31,36],[3,0,3,38],[58,0,58,38],[25,31,25,32],[25,33,25,35],[25,36,25,38],[0,0,0,38],[19,37,19,38],[20,27,20,29],[20,37,20,38],[16,27,16,38],[17,27,17,29],[17,30,17,36],[18,27,18,29],[13,37,13,38],[14,27,14,29],[14,30,14,36],[14,37,14,38],[1,0,1,4],[1,5,1,7],[1,8,1,27],[1,28,1,31],[1,32,1,38],[9,0,9,25],[4,0,4,38]]}
["「FOOD HOKKAIDO 2024」　エントリーシート【商品情報_1】\n【注意事項】　　\n※海外バイヤーとの商談のため、英語で入力していただく箇所もございます。\n　翻訳会社の紹介が必要な場合はお問い合わせください。\n\n※商品情報は、１品目ごとにご記入いただき、写真を必ず添付してください。文字情報のみでは商品のイメージがしにくいためお願いいたします。\n※（必須）欄は必ず記入いただくようお願いいたします。\n　 また、フォーマットの変更（シートを追加するなど）はご遠慮願います。"]
["企業Ｎｏ．",null,null,null,null,{"$f":"企業情報!$P$2","v":0},null,null,{"$f":"企業情報!$L$4","v":0},null,null,null,null,null,null,null,null,null,null,null,null,null,null,null,null,null,null,null,"商品No.",null,null,null,1]
[]
["【商品特性と取引条件】"]
["商品情報は、１品目毎にご記入し、写真を必ず添付してください。"]
["商品名（必須）",null,null,null,null,null,null,null,null,null,null,null,null,null,null,null,null,null,null,null,null,null,null,null,null,null,null,"品種・品目（必須）"]
{"$rows_left_out":100}
{"sheet":"商品情報_2_JP","index":3,"n_rows":100,"n_cols":46,"rows_kept":100,"cut":false,"hidden":false,"merged":[[2,0,2,38],[3,0,3,25],[3,27,3,38],[4,0,4,25],[5,0,5,25],[5,27,7,38],[6,0,6,25],[7,0,7,25],[0,0,0,38],[1,0,1,4],[1,5,1,7],[1,8,1,27],[1,28,1,31],[1,32,1,38],[11,37,11,38],[12,27,12,29],[12,30,12,36],[12,37,12,38],[13,27,13,29],[13,30,13,36],[13,37,13,38],[11,27,11,29],[11,30,11,36],[17,27,17,29],[17,30,17,36],[17,37,17,38],[18,27,18,29],[18,30,18,36],[18,37,18,38],[14,27,14,38],[15,27,15,29],[15,30,15,36],[15,37,15,38],[16,27,16,29],[16,30,16,36],[16,37,16,38],[27,37,27,38],[28,27,28,38],[22,27,22,38],[23,27,23,30],[23,31,23,32],[23,33,23,35],[23,36,23,38],[24,27,24,38],[19,27,19,29],[19,30,19,36],[19,37,19,38],[20,27,20,38],[21,27,21,36],[21,37,21,38],[35,0,35,38],[36,0,36,38],[37,0,38,38],[39,0,39,38],[40,0,41,38],[42,0,42,38],[29,27,29,36],[29,37,29,38],[30,27,30,38],[31,27,31,38],[32,27,32,38],[33,27,33,38],[8,0,33,25],[8,27,8,38],[9,27,9,29],[9,30,9,36],[9,37,9,38],[10,27,10,29],[10,30,10,36],[10,37,10,38],[25,28,25,32],[25,34,25,38],[26,27,26,38],[27,27,27,36],[43,0,43,38],[44,0,45,38],[46,0,46,38],[47,0,48,38],[50,0,50,38],[51,0,51,7],[51,8,51,15],[51,16,51,23],[51,24,51,31],[51,32,51,38],[52,0,52,7],[52,8,52,15],[52,16,52,23],[52,24,52,31],[52,32,52,38],[53,0,53,7],[53,8,53,9],[53,10,53,22],[53,23,53,24],[53,25,53,38],[56,33,56,38],[58,0,58,38],[59,0,59,22],[59,23,59,38],[60,23,60,38],[61,0,61,38],[54,0,54,38],[55,0,55,8],[55,9,55,18],[55,19,55,28],[55,29,55,38],[56,0,56,8],[56,9,56,15],[56,16,56,21],[56,22,56,27],[56,28,56,32],[65,0,65,12],[65,13,65,25],[65,26,65,38],[66,0,66,12],[66,13,66,18],[66,19,66,25],[62,0,62,7],[62,8,62,15],[62,16,62,23],[62,24,62,31],[62,32,62,38],[64,0,64,38],[80,0,80,38],[70,33,70,37],[72,0,72,38],[73,0,73,38],[74,0,75,38],[76,0,76,38],[77,0,78,38],[67,0,67,5],[67,6,67,38],[69,0,69,23],[69,26,69,31],[69,33,69,37],[70,0,70,8],[70,9,70,14],[70,15,70,17],[70,20,70,22],[70,26,70,31]]}
["「FOOD HOKKAIDO 2023」　エントリーシート【商品情報_2】\n【注意事項】　　\n※海外バイヤーとの商談のため、英語で入力していただく箇所もございます。\n　翻訳会社の紹介が必要な場合はお問い合わせください。\n\n※商品情報は、１品目ごとにご記入いただき、写真を必ず添付してください。文字情報のみでは商品のイメージがしにくいためお願いいたします。\n※（必須）欄は必ず記入いただくようお願いいたします。\n　 また、フォーマットの変更（シートを追加するなど）はご遠慮願います。"]
["企業Ｎｏ．",null,null,null,null,{"$f":"企業情報!$P$2","v":0},null,null,{"$f":"企業情報!$L$4","v":0},null,null,null,null,null,null,null,null,null,null,null,null,null,null,null,null,null,null,null,"商品No.",null,null,null,2]
["商品情報は、１品目毎にご記入し、写真を必ず添付してください。"]
["商品名（必須）",null,null,null,null,null,null,null,null,null,null,null,null,null,null,null,null,null,null,null,null,null,null,null,null,null,null,"品種・品目（必須）"]
["日本語"]
[null,null,null,null,null,null,null,null,null,null,null,null,null,null,null,null,null,null,null,null,null,null,null,null,null,null,null,"▼クリックしてプルダウンよりお選びください"]
{"$rows_left_out":95}
{"sheet":"商品情報_3_JP","index":4,"n_rows":100,"n_cols":46,"rows_kept":100,"cut":false,"hidden":false,"merged":[[2,0,2,38],[3,0,3,25],[3,27,3,38],[4,0,4,25],[5,0,5,25],[5,27,7,38],[6,0,6,25],[7,0,7,25],[0,0,0,38],[1,0,1,4],[1,5,1,7],[1,8,1,27],[1,28,1,31],[1,32,1,38],[11,37,11,38],[12,27,12,29],[12,30,12,36],[12,37,12,38],[13,27,13,29],[13,30,13,36],[13,37,13,38],[11,27,11,29],[11,30,11,36],[17,27,17,29],[17,30,17,36],[17,37,17,38],[18,27,18,29],[18,30,18,36],[18,37,18,38],[14,27,14,38],[15,27,15,29],[15,30,15,36],[15,37,15,38],[16,27,16,29],[16,30,16,36],[16,37,16,38],[27,37,27,38],[28,27,28,38],[22,27,22,38],[23,27,23,30],[23,31,23,32],[23,33,23,35],[23,36,23,38],[24,27,24,38],[19,27,19,29],[19,30,19,36],[19,37,19,38],[20,27,20,38],[21,27,21,36],[21,37,21,38],[35,0,35,38],[36,0,36,38],[37,0,38,38],[39,0,39,38],[40,0,41,38],[42,0,42,38],[29,27,29,36],[29,37,29,38],[30,27,30,38],[31,27,31,38],[32,27,32,38],[33,27,33,38],[8,0,33,25],[8,27,8,38],[9,27,9,29],[9,30,9,36],[9,37,9,38],[10,27,10,29],[10,30,10,36],[10,37,10,38],[25,28,25,32],[25,34,25,38],[26,27,26,38],[27,27,27,36],[43,0,43,38],[44,0,45,38],[46,0,46,38],[47,0,48,38],[50,0,50,38],[51,0,51,7],[51,8,51,15],[51,16,51,23],[51,24,51,31],[51,32,51,38],[52,0,52,7],[52,8,52,15],[52,16,52,23],[52,24,52,31],[52,32,52,38],[53,0,53,7],[53,8,53,9],[53,10,53,22],[53,23,53,24],[53,25,53,38],[56,33,56,38],[58,0,58,38],[59,0,59,22],[59,23,59,38],[60,23,60,38],[61,0,61,38],[54,0,54,38],[55,0,55,8],[55,9,55,18],[55,19,55,28],[55,29,55,38],[56,0,56,8],[56,9,56,15],[56,16,56,21],[56,22,56,27],[56,28,56,32],[65,0,65,12],[65,13,65,25],[65,26,65,38],[66,0,66,12],[66,13,66,18],[66,19,66,25],[62,0,62,7],[62,8,62,15],[62,16,62,23],[62,24,62,31],[62,32,62,38],[64,0,64,38],[80,0,80,38],[70,33,70,37],[72,0,72,38],[73,0,73,38],[74,0,75,38],[76,0,76,38],[77,0,78,38],[67,0,67,5],[67,6,67,38],[69,0,69,23],[69,26,69,31],[69,33,69,37],[70,0,70,8],[70,9,70,14],[70,15,70,17],[70,20,70,22],[70,26,70,31]]}
["「FOOD HOKKAIDO 2022」　エントリーシート【商品情報_3】\n【注意事項】　　\n※海外バイヤーとの商談のため、英語で入力していただく箇所もございます。\n　翻訳会社の紹介が必要な場合はお問い合わせください。\n\n※商品情報は、１品目ごとにご記入いただき、写真を必ず添付してください。文字情報のみでは商品のイメージがしにくいためお願いいたします。\n※（必須）欄は必ず記入いただくようお願いいたします。\n　 また、フォーマットの変更（シートを追加するなど）はご遠慮願います。"]
["企業Ｎｏ．",null,null,null,null,{"$f":"企業情報!$P$2","v":0},null,null,{"$f":"企業情報!$L$4","v":0},null,null,null,null,null,null,null,null,null,null,null,null,null,null,null,null,null,null,null,"商品No.",null,null,null,3]
["商品情報は、１品目毎にご記入し、写真を必ず添付してください。"]
["商品名（必須）",null,null,null,null,null,null,null,null,null,null,null,null,null,null,null,null,null,null,null,null,null,null,null,null,null,null,"品種・品目（必須）"]
["日本語"]
[null,null,null,null,null,null,null,null,null,null,null,null,null,null,null,null,null,null,null,null,null,null,null,null,null,null,null,"▼クリックしてプルダウンよりお選びください"]
{"$rows_left_out":95}
{"sheet":"Company profile","index":5,"n_rows":53,"n_cols":40,"rows_kept":53,"cut":false,"hidden":false,"merged":[[27,8,27,11],[27,14,27,17],[27,20,27,23],[27,26,27,29],[27,32,27,38],[52,2,52,9],[52,12,52,19],[52,22,52,29],[0,0,0,38],[23,0,23,38],[26,8,26,12],[26,15,26,19],[2,0,3,38],[4,0,4,38],[21,2,21,8],[21,11,21,17],[5,0,5,38],[20,0,20,38],[18,2,18,6],[18,7,18,38],[17,2,17,6],[43,12,43,38],[42,2,42,18],[42,21,42,38],[17,23,17,28],[26,2,26,5],[24,0,24,38],[30,0,30,38],[31,0,31,38],[33,0,33,38],[29,0,29,38],[27,2,27,5],[28,0,28,38],[26,22,26,27],[26,30,26,38],[25,0,25,38],[17,16,17,20],[45,2,45,18],[45,21,45,38],[44,0,44,38],[48,12,48,19],[47,0,47,38],[1,2,1,3],[15,2,15,6],[15,9,15,13],[15,16,15,20],[15,31,15,38],[14,0,14,38],[8,0,8,8],[8,9,8,18],[6,0,6,9],[7,0,7,9],[8,30,8,38],[12,31,12,38],[15,23,15,28],[9,19,9,27],[12,23,12,28],[12,9,12,13],[16,2,16,6],[9,0,9,8],[9,9,9,16],[16,16,16,20],[9,17,9,18],[16,9,16,13],[12,2,12,6],[12,16,12,20],[11,0,11,38],[9,30,9,38],[16,31,16,38],[16,23,16,28],[6,10,6,18],[7,10,7,18],[8,19,8,29],[9,28,9,29],[6,19,6,38],[7,19,7,38],[21,32,21,38],[21,29,21,31],[17,31,17,38],[21,20,21,26],[17,9,17,13],[50,2,50,9],[50,12,50,19],[50,22,50,29],[50,32,50,38],[34,2,34,38],[35,2,35,38],[36,2,36,38],[37,2,37,38],[38,2,38,38],[40,0,40,38],[39,0,39,38],[48,22,48,29],[48,30,48,38],[43,0,43,11],[41,0,41,38],[48,2,48,9]]}
[" Business Meeting\nApplication Form",null,null,null,null,null,null,null,null,null,null,null,null,null,null,null,null,null,null,null,null,null,null,null,null,null,null,null,null,null,null,null,null,null,null,null,null,null,null,"日本語"]
["No.",null,{"$f":"企業情報!P2","v":0}]
[{"$f":"企業情報!Y6","v":0}]
[]
["Address"]
[{"$f":"企業情報!L12","v":0}]
{"$rows_left_out":48}
{"sheet":"Product_1_EN","index":6,"n_rows":74,"n_cols":40,"rows_kept":74,"cut":false,"hidden":false,"merged":[[1,5,1,7],[1,8,1,27],[46,34,46,38],[48,0,48,38],[49,0,49,38],[47,2,47,7],[47,18,47,23],[47,10,47,15],[47,26,47,31],[47,34,47,38],[46,2,46,7],[46,10,46,15],[46,18,46,23],[46,26,46,31],[15,37,15,38],[12,30,12,36],[32,27,32,38],[7,0,32,25],[1,34,1,38],[5,0,6,25],[5,27,6,38],[10,30,10,36],[10,37,10,38],[9,30,9,36],[0,0,0,38],[73,39,76,39],[5,39,6,39],[67,26,67,38],[72,0,72,38],[73,0,76,38],[65,2,65,11],[63,2,63,11],[68,2,68,8],[34,39,37,39],[40,39,43,39],[3,0,3,38],[4,0,4,25],[18,30,18,36],[40,0,43,38],[8,27,8,29],[8,37,8,38],[9,27,9,29],[18,27,18,29],[1,0,1,4],[16,27,16,29],[29,27,29,38],[30,27,30,38],[31,27,31,38],[65,53,65,67],[63,14,63,26],[63,29,63,38],[64,14,64,26],[52,2,52,10],[63,53,63,67],[64,53,64,67],[57,33,57,38],[64,2,64,11],[61,0,61,12],[59,15,59,25],[20,27,20,36],[22,32,22,38],[8,30,8,36],[9,37,9,38],[10,27,10,29],[1,28,1,33],[11,27,11,29],[11,30,11,36],[11,37,11,38],[12,27,12,29],[14,27,14,29],[14,30,14,36],[14,37,14,38],[12,37,12,38],[28,27,28,36],[25,27,25,38],[15,27,15,29],[15,30,15,36],[53,13,53,16],[52,33,52,38],[57,2,57,6],[57,9,57,15],[28,37,28,38],[57,18,57,23],[57,26,57,30],[16,30,16,36],[16,37,16,38],[17,27,17,29],[17,30,17,36],[17,37,17,38],[21,27,21,38],[34,0,37,38],[24,27,24,38],[18,37,18,38],[20,37,20,38],[22,27,22,28],[22,29,22,31],[19,27,19,38],[68,39,68,51],[69,18,69,24],[69,26,69,38],[70,26,70,38],[68,26,68,38],[64,27,64,37],[23,27,23,38],[53,31,53,33],[53,19,53,22],[53,25,53,28],[67,18,67,24],[59,28,59,37],[68,22,68,24],[53,36,53,38],[52,13,52,21],[52,24,52,30],[68,11,68,17],[68,18,68,20],[65,12,65,38],[39,0,39,38],[59,2,59,12],[53,2,53,10],[26,27,26,36],[26,37,26,38]]}
[" Business Meeting\nApplication Form"]
["No.",null,null,null,null,{"$f":"企業情報!P2","v":0},null,null,{"$f":"企業情報!$Y$6","v":0},null,null,null,null,null,null,null,null,null,null,null,null,null,null,null,null,null,null,null,"Product No.",null,null,null,null,null,{"$f":"商品情報_1_JP!$AG$2","v":1},null,null,null,null,"日本語"]
[]
[]
["Product Name",null,null,null,null,null,null,null,null,null,null,null,null,null,null,null,null,null,null,null,null,null,null,null,null,null,null,"Description"]
[{"$f":"商品情報_1_JP!$A$10","v":0},null,null,null,null,null,null,null,null,null,null,null,null,null,null,null,null,null,null,null,null,null,null,null,null,null,null,{"$f":"IF(ISNA(VLOOKUP(商品情報_1_JP!AB8,品種・品目,2,FALSE)),\"\",VLOOKUP(商品情報_1_JP!AB8,品種・品目,2,FALSE))","v":0},null,null,null,null,null,null,null,null,null,null,null,{"$f":"商品情報_1_JP!A8","v":0}]
{"$rows_left_out":69}
{"sheet":"Product_2_EN","index":7,"n_rows":73,"n_cols":40,"rows_kept":73,"cut":false,"hidden":false,"merged":[[0,0,0,38],[71,0,71,38],[72,0,75,38],[72,39,75,39],[64,2,64,11],[64,12,64,38],[60,0,60,12],[62,2,62,11],[62,14,62,26],[62,29,62,38],[56,2,56,6],[56,9,56,15],[56,18,56,23],[56,26,56,30],[56,33,56,38],[58,2,58,12],[58,15,58,25],[58,28,58,37],[52,2,52,10],[52,13,52,16],[52,19,52,22],[52,25,52,28],[52,31,52,33],[52,36,52,38],[64,53,64,67],[66,18,66,24],[66,26,66,38],[67,2,67,8],[67,11,67,17],[67,18,67,20],[67,22,67,24],[67,26,67,38],[62,53,62,67],[63,2,63,11],[63,14,63,26],[63,27,63,37],[63,53,63,67],[34,0,37,38],[34,39,37,39],[39,0,39,38],[40,0,43,38],[40,39,43,39],[51,2,51,10],[51,13,51,21],[51,24,51,30],[51,33,51,38],[47,2,47,7],[47,10,47,15],[47,18,47,23],[47,26,47,31],[47,34,47,38],[48,0,48,38],[49,0,49,38],[28,27,28,36],[28,37,28,38],[19,27,19,38],[20,27,20,36],[20,37,20,38],[21,27,21,38],[22,27,22,28],[22,29,22,31],[22,32,22,38],[15,37,15,38],[16,27,16,29],[16,30,16,36],[16,37,16,38],[23,27,23,38],[24,27,24,38],[25,27,25,38],[26,27,26,36],[26,37,26,38],[5,39,6,39],[8,27,8,29],[8,30,8,36],[8,37,8,38],[9,27,9,29],[9,30,9,36],[12,27,12,29],[12,30,12,36],[12,37,12,38],[9,37,9,38],[10,27,10,29],[10,30,10,36],[10,37,10,38],[11,27,11,29],[11,30,11,36],[11,37,11,38],[1,0,1,4],[1,5,1,7],[1,8,1,27],[1,28,1,33],[1,34,1,38],[3,0,3,38],[4,0,4,25],[5,0,6,25],[5,27,6,38],[68,18,68,24],[68,26,68,38],[69,26,69,38],[29,27,29,38],[30,27,30,38],[31,27,31,38],[32,27,32,38],[7,0,32,25],[46,2,46,7],[46,10,46,15],[46,18,46,23],[46,26,46,31],[46,34,46,38],[14,27,14,29],[14,30,14,36],[14,37,14,38],[17,27,17,29],[17,30,17,36],[17,37,17,38],[18,27,18,29],[18,30,18,36],[18,37,18,38],[15,27,15,29],[15,30,15,36]]}
[" Business Meeting\nApplication Form"]
["No.",null,null,null,null,{"$f":"企業情報!P2","v":0},null,null,{"$f":"企業情報!$Y$6","v":0},null,null,null,null,null,null,null,null,null,null,null,null,null,null,null,null,null,null,null,"Product No.",null,null,null,null,null,{"$f":"商品情報_2_JP!$AG$2","v":2},null,null,null,null,"日本語"]
[]
[]
["Product Name",null,null,null,null,null,null,null,null,null,null,null,null,null,null,null,null,null,null,null,null,null,null,null,null,null,null,"Description"]
[{"$f":"商品情報_2_JP!$A$8","v":0},null,null,null,null,null,null,null,null,null,null,null,null,null,null,null,null,null,null,null,null,null,null,null,null,null,null,{"$f":"IF(ISNA(VLOOKUP(商品情報_2_JP!AB6,品種・品目,2,FALSE)),\"\",VLOOKUP(商品情報_2_JP!AB6,品種・品目,2,FALSE))","v":0},null,null,null,null,null,null,null,null,null,null,null,{"$f":"商品情報_2_JP!A6","v":0}]
{"$rows_left_out":68}
{"sheet":"Product_3_EN","index":8,"n_rows":74,"n_cols":40,"rows_kept":74,"cut":false,"hidden":false,"merged":[[5,39,6,39],[7,0,32,25],[8,27,8,29],[8,30,8,36],[8,37,8,38],[9,27,9,29],[0,0,0,38],[1,0,1,4],[1,5,1,7],[1,8,1,27],[1,28,1,33],[1,34,1,38],[9,30,9,36],[9,37,9,38],[10,27,10,29],[10,30,10,36],[10,37,10,38],[11,27,11,29],[11,30,11,36],[11,37,11,38],[3,0,3,38],[4,0,4,25],[5,0,6,25],[5,27,6,38],[15,27,15,29],[15,30,15,36],[15,37,15,38],[16,27,16,29],[16,30,16,36],[16,37,16,38],[12,27,12,29],[12,30,12,36],[12,37,12,38],[14,27,14,29],[14,30,14,36],[14,37,14,38],[19,27,19,38],[20,27,20,36],[20,37,20,38],[21,27,21,38],[22,27,22,28],[22,29,22,31],[22,32,22,38],[17,27,17,29],[17,30,17,36],[17,37,17,38],[18,27,18,29],[18,30,18,36],[18,37,18,38],[29,27,29,38],[30,27,30,38],[31,27,31,38],[32,27,32,38],[34,0,37,38],[34,39,37,39],[23,27,23,38],[24,27,24,38],[25,27,25,38],[26,27,26,36],[26,37,26,38],[28,27,28,36],[28,37,28,38],[47,2,47,7],[47,10,47,15],[47,18,47,23],[47,26,47,31],[47,34,47,38],[48,0,48,38],[39,0,39,38],[40,0,43,38],[40,39,43,39],[46,2,46,7],[46,10,46,15],[46,18,46,23],[46,26,46,31],[46,34,46,38],[53,36,53,38],[57,2,57,6],[57,9,57,15],[57,18,57,23],[57,26,57,30],[57,33,57,38],[49,0,49,38],[52,2,52,10],[52,13,52,21],[52,24,52,30],[52,33,52,38],[53,2,53,10],[53,13,53,16],[53,19,53,22],[53,25,53,28],[53,31,53,33],[63,53,63,67],[64,2,64,11],[64,14,64,26],[64,27,64,37],[64,53,64,67],[65,2,65,11],[65,12,65,38],[65,53,65,67],[59,2,59,12],[59,15,59,25],[59,28,59,37],[61,0,61,12],[63,2,63,11],[63,14,63,26],[63,29,63,38],[68,39,68,51],[69,18,69,24],[69,26,69,38],[70,26,70,38],[72,0,72,38],[73,0,76,38],[73,39,76,39],[67,18,67,24],[67,26,67,38],[68,2,68,8],[68,11,68,17],[68,18,68,20],[68,22,68,24],[68,26,68,38]]}
[" Business Meeting\nApplication Form"]
["No.",null,null,null,null,{"$f":"企業情報!P2","v":0},null,null,{"$f":"企業情報!$Y$6","v":0},null,null,null,null,null,null,null,null,null,null,null,null,null,null,null,null,null,null,null,"Product No.",null,null,null,null,null,{"$f":"商品情報_3_JP!$AG$2","v":3},null,null,null,null,"日本語"]
[]
[]
["Product Name",null,null,null,null,null,null,null,null,null,null,null,null,null,null,null,null,null,null,null,null,null,null,null,null,null,null,"Description"]
[{"$f":"商品情報_3_JP!$A$8","v":0},null,null,null,null,null,null,null,null,null,null,null,null,null,null,null,null,null,null,null,null,null,null,null,null,null,null,{"$f":"IF(ISNA(VLOOKUP(商品情報_3_JP!AB6,品種・品目,2,FALSE)),\"\",VLOOKUP(商品情報_3_JP!AB6,品種・品目,2,FALSE))","v":0},null,null,null,null,null,null,null,null,null,null,null,{"$f":"商品情報_3_JP!A6","v":0}]
{"$rows_left_out":69}
{"sheet":"データ(保護有り 削除不可）","index":9,"n_rows":55,"n_cols":66,"rows_kept":55,"cut":false,"hidden":true,"merged":[]}
["品種・品目","英語","繁体字","簡体字","韓国語","ポルトガル語","仏語","長さ","重量","賞味期限_新","英語","簡体字","韓国語","ポルトガル語","仏語","賞味期限_単位","英語","繁体字","簡体字","韓国語","ポルトガル語","仏語","ケース","英語","繁体字","簡体字","韓国語","ポルトガル語","仏語","ロット","英語","繁体字","簡体字","韓国語","ポルトガル語","仏語","ラベル","英語","簡体字","韓国語","ポルトガル語","仏語","OEM","英語","性別","英語","繁体字","簡体字","韓国語","ポルトガル語","仏語","内容量","品質保持期限","英語","繁体字","簡体字","韓国語","ポルトガル語","仏語",null,"輸出体制（現Verでは不要）","英語","簡体字","韓国語","ポルトガル語","仏語"]
["▼クリックしてプルダウンよりお選びください",null,null,null,null,null,"Cliquer et choisir dans la liste déroulante","▼","▼","▼",null,null,null,null,null,"▼",null,null,null,null,null,null,"▼",null,null,null,null,null,null,"▼",null,null,null,null,null,null,"▼プルダウン",null,"请在下拉菜单中选择","풀다운으로부터 선택하십시오","Selecione pelo menu suspenso","Choisir dans la liste déroulante","▼プルダウン",null,"プルダウンよりお選びください",null,null,null,null,null,null,"▼","▼","▼",null,null,null,null,null,null,"プルダウンよりお選びください"]
["肉・肉を用いた加工品","Raw and processed meat","肉/肉類的加工品","肉/肉类加工品","육류, 육류를 이용한 가공품","Carnes/ produtos processados com carne","Viande/produits transformés contenant de la viande","cm","mg","常温","Normal","常温","상온","Temperatura normal","Température ambiante","日","days","天","日","일","dia(s)","jour","本","bottle","本","条","개","Unidade","Bouteille","個",null,null,null,null,null,null,"可","We can label","可应对","대응 가능","Possível","Possible","可","We can","男性","Male","男人","男","남자","Masculino","Hommes","ml","賞味期限","best before",null,null,null,null,null,1,"専任の輸出担当者を設置している","Have full-time staff in charge of export","设置专门的出口负责人","전임수출담당자를 지정하고 있음","Há encarregado de exportação a tempo integral","Personnel en charge de l'export à plein-temps"]
["酪農製品・鳥卵・鳥卵加工品","Dairy products/raw and processed eggs","酪農產品/雞蛋/雞蛋加工品","乳制品/禽蛋/禽蛋加工品","유제품, 달걀류가공품","Laticínios/ ovos de aves/ ovos processados ","Produits laitiers/œufs/produits transformés à base d'œufs","mm","g","冷蔵","Cold","冷藏","냉장","Refrigeração","Réfrigération","カ月","month","月","月","개월","mês(es)","mois","箱","box","箱","箱","상자","Caixa","Caisse","本","bottle","本","条","개","Unidade","Bouteille","不可","We cannot label","不可应对","대응 불가능","Não é possível","Impossible","不可","We cannot","女性","Female","女人","女","여자","Feminino","Femmes","l","消費期限","use by date",null,null,null,null,null,2,"専任ではないが担当者を設置している","Have part-time staff in charge of export","设置非专门的负责人","전임은 아니지만 담당자를 지정하고 있음","Há encarregado de exportação, mas não em tempo integral","Personnel en charge de l'import à temps partiel"]
["魚介類・魚介類加工品","Raw and processed seafood","魚貝類/魚貝類加工品","鱼贝类/鱼贝类加工品","어패류, 어패류 가공품","Peixes e frutos do mar/ peixes e frutos do mar processados ","Poissons et fruits de mer/produits transformés à base de poissons et fruits de mer",null,"kg","冷凍","Frozen","冷冻","냉동","Congelação","Congélation","年","year","年","年","년","ano(s)","année","包","pack","包","包","포","Invólucro","Paquet","箱","box","箱","箱","상자","Caixa","Caisse",null,null,null,null,null,null,null,null,"男女両方","Both Male and Female","男人女人都","男女皆可","남녀 모두","Masc. e fem.","Hommes et femmes","g",null,null,null,null,null,null,null,3,"今後担当者を設置する予定","Planning to have staff in charge of export","预计在今后设置负责人","앞으로 담당자를 지정할 예정","Previsão de colocar encarregado futuramente","Prévoit d'employer du personnel en charge de l'export "]
["穀類・穀類等加工品","Raw and processed grains","穀類/穀類加工品","粮食/粮食加工品","곡류, 곡류 등 가공품","Grãos/ grãos processados","Céréales/produits transformés à base de céréales",null,null,null,null,null,null,null,null,null,null,null,null,null,null,null,"ケース","case","盒","盒","케이스","Caixa","Étui","包","pack","包","包","포","Invólucro","Paquet",null,null,null,null,null,null,null,null,null,null,null,null,null,null,null,"kg",null,null,null,null,null,null,null,4,"今のところ設置する予定はない","No plan to have staff in charge of export","现暂无设置计划","현재 지정할 예정 없음","Sem previsão de colocar encarregado no momento","Ne prévoit pas d'employer du personnel en charge de l'export"]
{"$rows_left_out":49}